C/C++ :: Error Variable Or Field View Declared Void
Oct 10, 2014
On running the following codes I'm getting these errors. I'm using Code Blocks 13.12
void view(string); //error: variable or field 'view' declared void & error: 'string' was not declared in this scope
void customer()
{
char ch;
[Code]....
View 4 Replies
ADVERTISEMENT
Sep 17, 2014
Why I am getting this error
error: variable or field createBinaryFile declared void
void createBinaryFile(std::fstream&, std::ifstream&);
View 2 Replies
View Related
Mar 29, 2014
I'm creating a payroll program and here is my code
Code:
#include <stdio.h>
#include <stdlib.h>
#include <string.h>
#define REPORTHEADING1 " Employee Pay Hours Gross Tax Net
"
#define REPORTHEADING2 " Name Rate Worked Pay Due Pay
}
[code]....
The errors I get are: variable or field PrintSummaryReport declared void in function voidPrintSummaryReport... cannot convert FILE to const car for argument to int printf(const char*...) which is for the following lines
Code:
printf(reportFile,REPORTLINEFORMAT1,fullName,payrate,regHours,gross,fedtax,
ssitax,netpay);
printf(reportFile,REPORTLINEFORMAT2,ovtHours,statetax,deferred);
View 7 Replies
View Related
Mar 28, 2014
I'm creating a payroll program and here is my code
#include <stdio.h>
#include <stdlib.h>
#include <string.h>
#define REPORTHEADING1 " Employee Pay Hours Gross Tax Net
"
#define REPORTHEADING2 " Name Rate Worked Pay Due Pay
[code]....
View 14 Replies
View Related
Jan 16, 2012
I am experiencing some errors with my first c++ program. im getting some compilation errors that i cannot figure out.
In file included from w2.cpp:7:
Fraction.h:17: error: variable or field 'enter' declared void
Fraction.h:17: error: expected primary-expression before 'struct'
Fraction.h:18: error: variable or field 'display' declared void
and so on ..........
Code:
#include "fraction.h"
//using namespace std;
/*
int main() {
struct Fraction fraction;
cout << "Fraction Simplifier" << endl;
cout << "===================" << endl;
enter(&fraction);
[Code] .....
View 1 Replies
View Related
Jan 27, 2014
I'm working through this neural network tutorial, unfortunately I get stuck trying to compile on line 28, saying "error: 'neuronNum' not declared in this scope." I seem to always get stuck on these kinds of errors, yet I don't understand because I though that the variable was declared and initialized within the for loop.
#include <iostream>
#include <vector>
using namespace std;
[Code]....
View 5 Replies
View Related
Dec 5, 2014
I'm writing a class "Property" for a program that manages different types of properties. This is my .h for y base class. I was trying to write a virtual void function to convert different children classes to strings that can be displayed, but Xcode is freaking out.
I had it as:
virtual void toString()= 0;
and it gave me an error message: "Virtual can only exist in non-static member functions" and "field has incomplete type 'void'"
I changed it to:
virtual string toString() = 0;
and the error message didn't change.
Is this an issue with Xcode or did I do something wrong? Even after changing it to string it told me that it "has incomplete type 'void'"....
View 1 Replies
View Related
Mar 31, 2014
I'm working on this program, and when i run it for 'p', 'P', or for a incorrect service code a error message pops up saying that "totalCost is being used without being initialized". I don't want to change it to switches, case, and breaks now because I've come too far to change it all. I have that variable right here just below.
#include <iomanip>
#include <iostream>
using namespace std;
int main() {
int acctCode;
double nightCost;
double totalCost;
[Code] ....
View 4 Replies
View Related
Oct 29, 2014
main.cpp
#include <iostream>
#include "sushi.h"
using namespace std;
int main()
{
do {
......sushi go;
......string x; <----------------------------Declared x here
......cout << "wanna use a banana?" << endl;
[Code ....
Error reads: 'x' was not declared in this scope.
How do I fix this?
P.S The sushi class does not matter, that is all perfect. Also, the dots are to represent my tabbing to make it easier to understand.
View 2 Replies
View Related
Jan 28, 2014
I'm trying to make a dynamic 2d array of a Tile Object I created, the Dynamic 2d array was working when I tested it as an int array but not that I gave it a type of Tile it is giving me the above error. I'm reading values from a .txt .
tile Tile;
Tile **grid;
grid = new Tile*[a];
for (int i = 0; i < a; ++i) {
grid[i] = new Tile[b];
}
View 9 Replies
View Related
Jul 25, 2013
How to declare variable for all void() as I have another void s in my C++ program. I want to have a variable that can use for all the void and not only in a simple void.Is it possible?
View 17 Replies
View Related
Feb 10, 2015
I am trying to make a linked list. When I compile my code, I get an error saying 'current' is not declared in this scope. I don't understand because I have declared in the first line of my functions body. The variable is local to the function so I don't understand what the problem is.
#include <iostream>
#include <cstdlib>
using namespace std;
class LinkedList {
public:
LinkedList() // default constructor makes an empty list
[code].....
View 2 Replies
View Related
Apr 5, 2014
I'm trying to create a public and static field in a class called ResourceManager. But when trying to access the field even from inside the class it wont work. I'm getting this error message:
Error 1 error LNK2001: unresolved external symbol "public: static int ResourceManager::num" (?num@ResourceManager@@2HA)
Here's my code:
ResourceManager.h
Code:
class ResourceManager {
public:
static int num;
static void loadContent();
[Code] .....
I'm using Visual Studio 2012.
View 2 Replies
View Related
Apr 12, 2015
So I have this class
class DataBase
{
// Change the connection path here to your own version of the database
public SqlConnection con = new SqlConnection(@"Data Source=(LocalDB)v11.0;AttachDbFilename=|DataDirectory|UberDatabase.mdf;Integrated Security=True;");
public DataBase()
{
}
}
And in the same namespace as this class I have a form that calls it like so:
DataBase dBase = new DataBase();
SqlCommand trythis = new SqlCommand("Register", dBase.con);
However, I'm getting the field initializer error on dBase.con. I'm not sure why, but when I call the database from another file (program.cs) it works fine this way.
View 8 Replies
View Related
May 4, 2014
Using a template in the assignment, I don't know what I did wrong?
Code:
#include <iostream>
#include <string>
using namespace std;
template<class T>
void mpgcalc(T& Miles, T& Gallons)
[Code] .....
View 2 Replies
View Related
Dec 1, 2013
How can I add the variable adress to a void pointer inside of a class?
class variant2 {
private:
void *Vvariant=NULL;
public:
template<typename b>
variant & operator = (b *adress)
[Code] ....
if possible i want avoid the '&' when i assign the variable address.(variant2 f=varname;//like you see i don't use the '&')
for the moment i just need put the address to Variant pointer. but i receive several errors .
View 4 Replies
View Related
Mar 14, 2014
I keep getting an error "Invalid use of void expression" on line 12.
Code:
#include<stdio.h>
#include<stdlib.h>
void initialiaze_array( int size );
void print_array( int size );
void replace( int num, int i );
[Code] ....
View 3 Replies
View Related
Oct 22, 2014
I making a simple single number scrambler/encryptor and as I tried to build the console application the following error
occurred:
error: invalid operands of types 'void' and 'int' to binary 'operator%'
The source code is bellow.
#include <iostream>
#include <math.h>
#include <cstdlib>
using namespace std;
int main() {
int nTimer;
int nInput;
[Code]......
I am running code::blocks as my IDE on Ubuntu.
View 2 Replies
View Related
Jul 22, 2014
I have a program I have been working on where the user selects a date and enters the number of days to be viewed in the Calendar.cshtml view. This input renders another view (Update.cshtml) that contains two date picker boxes, one that should contain the selected date and the second one that should contain the calculated date. I am having an issue getting the date selected in the first view to populate to the first date block on the second view as the default and getting the calculated date to populate the second date block in the Update.cshtml view. In addition given the two dates, I would like to generate a calendar, which is why I chose the date picker approach and setting static dates.
Here is my code:
**CalendarController:**
using System.Web.Mvc;
using VanickCalendarApp.Models;
using System;
namespace VanickCalendarApp.Controllers {
public class CalendarController : Controller {
[Code] .....
View 5 Replies
View Related
Jul 16, 2013
I've encountered a slight logical error in my code
/*
Lab06_pensionplans.cpp
Purpose :
- Create a simple financial application to calculate retirement plans
*/
#include <iostream>
#include <cstdlib>
using namespace std;
void displayMenu() {
system("cls");
[Code] ....
Look at case 2, which the user supposed to key in a new input, the problem is the value will never got into main function, I don't know what should I modify with the function.
Figured out I need to change the
void changeData(int startingAge, int numOfYears,
double lumpSumAmount, double yearlyAmount, double interestRate )
into
void changeData(int &startingAge, int &numOfYears,
double &lumpSumAmount, double &yearlyAmount, double &interestRate )
View 2 Replies
View Related
Apr 25, 2013
I having a problem which I'm not able to resovle. I try to dereference a void pointer but I always get a C2440 error. It says: 'static_cast':void* cannot be converted in wqueue<T>. I tried different cast ways but I always get the same error. As far as I found out I should get the error if I try to dereference without cast but in my case I cast before and still get that error.
void *srumbler (void *arg) {
wqueue<workclas*> m_queue= static_cast<wqueue<workclass*>>(arg);
return NULL;
}
The according type wqueue in the header file:
template <typename T> class wqueue {
list<T> m_queue;
pthread_mutex_t m_mutex;
pthread_cond_t m_condv;
[Code] .....
View 3 Replies
View Related
May 6, 2014
I declared all functions in header file, such as:
bool readCase();
bool meshing();
bool readMesh();
bool calculateFlowfield();
bool readFlowfield();
bool calculateEvaporation();
And then I define them in separated .cpp files, each .cpp file include the header, but I got multiple definition error, why?
Even the int main() function, which only decalred and defined once got this error, why?
View 14 Replies
View Related
Jan 30, 2013
struct x
{
y *GetY(); //error: what is "y"?
struct y
{
};
};
Why does GetY have to be declared after struct y is declared? I thought order of class members in C++ did not matter? Does it have to do with the way parsing is done?
EDIT: It also doesn't work if I typename x::y *GetY();, which makes even less sense to me.
EDIT: It works if I forward declare, but this goes against everything I know about C++ classes...
View 6 Replies
View Related
Mar 17, 2014
I finished my project and it does work, but every time I hit enter to end the program I get an error that says my variable array is corrupted.
here is my code:
#include <iostream>
#include <ctime>
using namespace std;
int main() {
system ("color C");
[Code] ....
How could I stop this end error from occurring?
View 6 Replies
View Related
Jan 30, 2014
I have one problem with my code it's working until end of this program and program show this error: Run-Time check failure #2 - Stack around the variable 'Obsd" was corrupted.
here is a code, :
#include <iostream>
#include <conio.h>
using namespace std;
struct SData {
int SDSamples;
float SDSampleCount;
[code]....
View 1 Replies
View Related
Jan 8, 2015
#include <iostream>
#include <string>
struct WeatherStats {
double total_rainfall;
int high_temp;
int low_temp;
int avg_temp;
[Code] ....
When I run this program I am able to input data for the three months but after inputting everything I am prompted with a run time error that states: Run time check failure#3: The variable 'temp' is being used without being initialized. I've underlined the statement that the compiler says is causing this error, yet there is no variable 'temp' in that statement.
Computer are very specific right? So in the problem statement total_yearly_temp = total_yearly_temp + temp.avg_temp; there is a variable called total_yearly_temp and one called temp.avg_temp, but there are none called temp. It can't be complaining about the WeatherStats variable I defined in the first line of the function called temp because I did the exact same thing in the previous function and there are no errors concerning that.
View 3 Replies
View Related